{"text_format":"1","workbook":"xlsx","n_sheets":9,"sheets":["PWR","Blank PWR","data","Colleges","Other Agencies","DSHS","DES","DOC","IAA Fee %"],"not_rendered":{"charts":0,"images":1,"macros":1,"external_links":0,"defined_names":269,"comments":0,"pivot_tables":0},"unopened":[],"bounds":{"document_bytes":16777216,"sheet_cells":100000,"rows_first":2000,"rows_last":500,"rows_between":2000,"halvings":0,"cell_chars":16384,"cell_head_chars":4096},"cells_cut":0,"cells_raw":0,"read":"whole","date_system":"1900"}

{"sheet":"PWR","index":0,"n_rows":58,"n_cols":15,"rows_kept":58,"cut":false,"hidden":false,"merged":[[46,2,46,3],[56,2,56,4],[54,2,54,13],[55,2,55,4],[55,9,55,10],[56,5,56,7],[56,12,56,13],[56,9,56,10],[55,12,55,13],[55,5,55,7],[50,2,52,13],[47,2,47,3],[48,2,48,3],[47,4,47,7],[48,4,48,7],[17,10,17,13],[36,3,36,4],[23,2,23,13],[26,2,26,13],[17,5,17,7],[33,7,33,10],[34,8,34,10],[2,10,2,14],[6,2,6,14],[14,10,14,13],[8,12,8,13],[14,5,14,8],[10,11,10,13],[11,11,11,13],[38,12,38,13],[46,4,46,7],[47,10,48,13],[48,8,48,9],[45,7,45,10],[46,8,46,9],[40,5,40,7],[37,9,37,10],[39,9,39,10],[15,10,15,13],[16,10,16,13],[9,2,9,3],[9,5,9,9],[9,12,9,13],[15,5,15,8],[28,2,28,13],[34,12,34,13],[35,12,35,13],[36,5,36,7],[35,9,35,10],[30,9,30,10],[31,9,31,10],[31,12,31,13]]}
[]
[]
[null,null,null,null,null,null,null,null,null,null,"DIVISION OF ENGINEERING AND ARCHITECTURAL SERVICES"]
[null,null,null,null,null,null,null,null,null,null,"1500 Jefferson Street SE"]
[null,null,null,null,null,null,null,null,null,null,"Olympia, WA 98504-1476"]
[]
[null,null,"PWR - PUBLIC WORKS REQUEST"]
[]
[null,null,"AGENCY",null,null,"ORDERING AGENCY NAME",null,null,null,null,null,"Agency No.","Date Ordered"]
[null,null,null,null,null,null,null,null,null,null,null,{"$f":"IFERROR(IF(C10=\"SBCTC\",VLOOKUP(F10,Colleges[],6,2),IF(C10=\"DSHS\",VLOOKUP(F10,DSHS[],6,2),IF(C10=\"DOC\",VLOOKUP(F10,DOC[],6,2),IF( C10=\"OTHER\",VLOOKUP(F10,OtherAgencies[],6,2),IF(C10=\"DES\",VLOOKUP(F10,DESInfo[],6,2),\" \"))))), \" \")","v":" "}]
[null,null,null,null,null,{"$f":"IFERROR(IF(C10=\"DSHS\",(VLOOKUP(C10,DSHS[],2,2)),IF(C10=\"SBCTC\",VLOOKUP(F10,Colleges[],2,2),IF(C10=\"DOC\",VLOOKUP(C10,DOC[],2, 2),IF(C10=\"Other\",VLOOKUP(F10,OtherAgencies[],2,2),IF(C10=\"DES\",(VLOOKUP(C10,DESInfo[],2,2)),\" \"))))),\" \")","v":" "},null,null,null,null,null,"Delegated Authority"]
[null,null,null,null,null,{"$f":"IFERROR(IF(C10=\"DSHS\",(VLOOKUP(C10,DSHS[],3,2)),IF(C10=\"SBCTC\",VLOOKUP(F10,Colleges[],3,2),IF(C10=\"DOC\",VLOOKUP(C10,DOC[],3, 2),IF(C10=\"Other\",VLOOKUP(F10,OtherAgencies[],3,2),IF(C10=\"DES\",(VLOOKUP(C10,DESInfo[],3,2)),\" \"))))),\" \")","v":" "},null,null,null,null,null,"No"]
[]
[null,null,null,null,null,"PROJECT LOCATION",null,null,null,null,"MAIL INVOICE TO:"]
[null,null,{"$f":"IF(C10=\"SBCTC\",\"Campus:\",(IF(C10=\"DSHS\",\"Facility:\",IF(C10=\"DOC\",\"Correction Center:\",IF(C10=\"DES\",\"Location:\", \"Campus:\")))))","v":"Campus:"}]
{"$rows_left_out":44}
{"sheet":"Blank PWR","index":1,"n_rows":57,"n_cols":15,"rows_kept":57,"cut":false,"hidden":false,"merged":[[10,11,10,13],[11,11,11,13],[10,5,10,9],[11,5,11,9],[16,5,16,9],[14,5,14,8],[14,10,14,13],[15,5,15,8],[15,10,15,13],[16,10,16,13],[2,10,2,14],[6,2,6,14],[8,12,8,13],[9,5,9,9],[9,12,9,13],[34,7,34,10],[19,5,19,9],[20,5,20,9],[35,8,35,10],[17,5,17,9],[18,5,18,9],[17,10,17,13],[23,2,23,13],[26,2,26,13],[29,2,29,13],[32,12,32,13],[37,3,37,4],[37,5,37,7],[39,12,39,13],[45,2,45,3],[45,4,45,7],[45,8,45,9],[41,5,41,7],[36,9,36,10],[38,9,38,10],[40,9,40,10],[35,12,35,13],[36,12,36,13],[47,8,47,9],[46,2,46,3],[55,2,55,4],[55,5,55,7],[55,9,55,10],[46,4,46,7],[46,10,47,13],[47,2,47,3],[47,4,47,7],[55,12,55,13],[49,2,51,13],[53,2,53,13],[54,2,54,4],[54,5,54,7],[54,9,54,10],[54,12,54,13]]}
[]
[]
[null,null,null,null,null,null,null,null,null,null,"DIVISION OF ENGINEERING AND ARCHITECTURAL SERVICES"]
[null,null,null,null,null,null,null,null,null,null,"1500 Jefferson Street SE"]
[null,null,null,null,null,null,null,null,null,null,"Olympia, Wa 98504-1476"]
[]
[null,null,"PWR - PUBLIC WORKS REQUEST"]
[]
[null,null,null,null,null,"ORDERING AGENCY NAME",null,null,null,null,null,"Agency No.","Date Ordered"]
[]
[null,null,null,null,null,null,null,null,null,null,null,"Delegated Authority"]
[null,null,null,null,null,null,null,null,null,null,null,"No"]
[]
[null,null,null,null,null,"PROJECT LOCATION",null,null,null,null,"MAIL INVOICE TO:"]
[null,null,{"$f":"IF(C10=\"SBCTC\",\"Campus:\",(IF(C10=\"DSHS\",\"Facility:\",IF(C10=\"DOC\",\"Correction Center:\",IF(C10=\"DES\",\"Location:\", \"Campus:\")))))","v":"Campus:"}]
{"$rows_left_out":43}
{"sheet":"data","index":2,"n_rows":237,"n_cols":24,"rows_kept":237,"cut":false,"hidden":true,"merged":[[5,16,5,20]]}
[null,"College","Address1","Adress2","Leg District","Team","Agency Code","Abrv","CampusLook","BLDGLook","BLDGList","Agency","Yes/No List",null,"add space before name"]
[null,"Bates Technical College","1101 S Yakima Ave","Tacoma, WA 98405",29,"A",695,"BATES","BATESCamp","BATESBldg","BATESBldgList","SBCTC","Yes",null,"Team A"]
[null,"Bellevue College","3000 Landerholm Circle SE","Bellevue, WA 98007 ",41,"B",627,"BC","BCCamp","BCCBldg","BCBldgList","DES","No",null," David Hruska"]
[null,"Bellingham Technical College","3028 Lindbergh Ave","Bellingham, WA 98225-1599 ",42,"B",694,"BTC","BTCCamp","BTCCBldg","BTCBldgList","DSHS",null,null," Dennis Flynn"]
[null,"Big Bend Community College","7662 Chanute St NE ","Moses Lake, WA 98837-3299",13,"B",629,"BBC","BBCCamp","BBCBldg","BBCBldgList","DOC",null,null," Diana Peeples"]
[null,"Cascadia College","18345 Campus Way NE ","Bothell, WA 98011",1,"B",634,"CCC","CCCCamp","CCCBldg","CCCBldgList","OTHER",null,null," Dino Othieno",null,"Drop down Look ups"]
[null,"Centralia College","18345 Campus Way NE","Bothell, WA 98011 ",20,"A",632,"CEC","CECCamp","CECBldg","CECBldgList",null,null,null," Julie Nakahara",null,null,null,"DSHS","DOC","DES"]
[null,"Clark College","1933 Fort Vancouver Way","Vancouver, WA 98663 ",49,"A",635,"CLC","CLCCamp","CLCBldg","CLCBldgList","OTHER",null,null," Phil Timpke",null,"Campus look up",{"$f":"IFERROR(IF(PWR!$C$10=\"SBCTC\",(VLOOKUP(PWR!$F$10,Colleges[],8,2)),IF(PWR!$C$10=\"DSHS\",(VLOOKUP(PWR!$C$10,DSHS[],8,1)),IF(PWR!$C$10=\"DOC\",(VLOOKUP(PWR!$C$10,DOC[],8,1)),IF(PWR!$C$10=\"DES\",(VLOOKUP(PWR!$C$10,DESInfo[],8,1)),(VLOOKUP(PWR!$C$10,Other,8,1)))))),\" \")","v":" "}]
[null,"Clover Park Technical College","4500 Steilacoom Blvd SW","Lakewood, WA 98499-4004 ",29,"A",696,"CPTC","CPTCCamp","CPTCBldg","CPTCBldgList","Military Department",null,null," Rafael Urena",null,"Building look up",{"$f":"IFERROR(IF(PWR!$C$10=\"SBCTC\",(VLOOKUP(PWR!$F$10,Colleges[],9,2)),IF(PWR!$C$10=\"DSHS\",(VLOOKUP(PWR!$C$10,DSHS[],9,1)),IF(PWR!$C$10=\"DOC\",(VLOOKUP(PWR!$C$10,DOC[],9,1)),IF(PWR!$C$10=\"DES\",(VLOOKUP(PWR!$C$10,DESInfo[],9,2)),(VLOOKUP(PWR!$C$10,Other,9,2)))))),\" \")","v":" "},{"$f":"IF(PWR!C10=\"DSHS\",VLOOKUP(PWR!F15,DSHSFac[],8,TRUE))","v":false},{"$f":"IF(PWR!C10=\"DOC\",VLOOKUP(PWR!F15,DOCFacilities[],5,TRUE))","v":false},{"$f":"IF(PWR!C10=\"DES\",VLOOKUP(PWR!F15,DESFac[],6,TRUE))","v":false}]
[null,"Columbia Basin College","2600 N 20th","Pasco, WA 99301-3397",16,"B",639,"CBC","CBCCamp","CBCBldg","CBCBldgList","Washington State Patrol",null,null," Ronnie Hill",null,"Building List",{"$f":"IFERROR(IF(PWR!C10=\"SBCTC\",(VLOOKUP(PWR!$F$10,Colleges[],10,2)),IF(PWR!C10=\"DSHS\",(VLOOKUP(PWR!C10,DSHS[],10,1)),IF(PWR!C10=\"DOC\",(VLOOKUP(PWR!C10,DOC[],10,1)),IF(PWR!$C$10=\"DES\",(VLOOKUP(PWR!$C$10,DESInfo[],10,2)),(VLOOKUP(PWR!$C$10,Other,10,1)))))),\" \")","v":" "},{"$f":"IF(PWR!C10=\"DSHS\",VLOOKUP(PWR!F15,DSHSFac[],9,TRUE))","v":false},{"$f":"IF(PWR!C10=\"DOC\",VLOOKUP(PWR!F15,DOCFacilities[],6,TRUE))","v":false},{"$f":"IF(PWR!C10=\"DES\",VLOOKUP(PWR!F15,DESFac[],7,TRUE))","v":false}]
[null,"Edmonds Community College","20000 68th Ave W","Lynnwood, WA 98036 ",21,"B",610,"EDC","EDCCamp","EDCBldg","EDCBldgList","Dept of Ecology",null,null," Stacy  Simpson"]
[null,"Everett Community College","2000 Tower St","Everett, WA 98201-1390 ",38,"B",605,"EVC","EVCCamp","EVCBldg","EVCBldgList","State School for the Blind",null,null," Yelena Semenova"]
[null,"Grays Harbor College","1620 Edward P Smith Dr ","Aberdeen, WA 98520",19,"A",648,"GHC","GHCCamp","GHCBldg","GHCBldgList","School for the Deaf",null,null,"Team B"]
[null,"Green River College","12401 SE 320th St","Auburn, WA 98092-3699 ",31,"B",649,"GRC","GRCCamp","GRCBldg","GRCBldgList","Ciminal Justice Training Commission",null,null," Bob Colasurdo"]
[null,"Highline Community College","2400 S 240th","Des Moines, WA 98198-9800 ",33,"B",652,"HCC","HCCCamp","HCCBldg","HCCBldgList","Washington State Center for Childhood Deafness and Hearing Loss ",null,null," Dave Lohrengel"]
{"$rows_left_out":223}
{"sheet":"Colleges","index":3,"n_rows":1038,"n_cols":10,"rows_kept":1038,"cut":false,"hidden":true,"merged":[]}
[null,null,"BATESBldgList"]
["Agency Assigned Name","Campus","Agency Common Name","UFI","ADDRESS1","CITY","Zip Code","STATE","COUNTY","Legislative District"]
[" BATES T. C. - MAIN CAMPUS","Main Campus","WEST ANNEX","A08982","1101 S YAKIMA AVE","TACOMA",98405,"WA","PIERCE",27]
[" BATES T. C. - MAIN CAMPUS","Main Campus","EAST ANNEX","A04062","1101 S YAKIMA AVE","TACOMA",98405,"WA","PIERCE",27]
[" BATES T. C. - MAIN CAMPUS","Main Campus","MAIN","A03217","1101 S YAKIMA AVE","TACOMA",98405,"WA","PIERCE",27]
[" BATES T. C. - SOUTH CAMPUS","South Campus","SOUTH CAMPUS","A09690","2201 S 78TH ST","TACOMA",98409,"WA","PIERCE",29]
[" BATES T. C. - SOUTH CAMPUS","South Campus","SOUTH CAMPUS","A09660","2201 S 78TH ST","TACOMA",98409,"WA","PIERCE",29]
[" BATES T. C. - SOUTH CAMPUS","South Campus","SOUTH CAMPUS","A14674","2201 S 78TH ST","TACOMA",98409,"WA","PIERCE",29]
[" BATES T. C. - SOUTH CAMPUS","South Campus","SOUTH CAMPUS","A05138","2201 S 78TH ST","TACOMA",98409,"WA","PIERCE",29]
[" BATES T. C. - SOUTH CAMPUS","South Campus","SOUTH CAMPUS","A07704","2201 S 78TH ST","TACOMA",98409,"WA","PIERCE",29]
[" BATES T. C. - SOUTH CAMPUS","South Campus","SOUTH CAMPUS","A04104","2201 S 78TH ST","TACOMA",98409,"WA","PIERCE",29]
[" BATES T. C. - SOUTH CAMPUS","South Campus","SOUTH CAMPUS","A06330","2201 S 78TH ST","TACOMA",98409,"WA","PIERCE",29]
[" BATES T. C. - SOUTH CAMPUS","South Campus","SOUTH CAMPUS","A02594","2201 S 78TH ST","TACOMA",98409,"WA","PIERCE",29]
[" BATES T. C. - SOUTH CAMPUS","South Campus","SOUTH CAMPUS","A02642","2201 S 78TH ST","TACOMA",98409,"WA","PIERCE",29]
[" BATES T. C. - SOUTH CAMPUS","South Campus","SOUTH CAMPUS","A01591","2201 S 78TH ST","TACOMA",98409,"WA","PIERCE",29]
{"$rows_left_out":1024}
{"sheet":"Other Agencies","index":4,"n_rows":446,"n_cols":49,"rows_kept":446,"cut":false,"hidden":true,"merged":[]}
[null,null,null,null,"Criminal Justice Training Commission"]
[20,6,"KING","A09860","EDUCATION BUILDING",null,"Owned","ACTIVE","BUILDING","EDUCATIONAL","18926 1ST PL S",null,"BURIEN","KING","WA",98148,"US","Jan 1, 1992, 12:00 AM",null,null,null,47.433525000000003,-122.33326099999999,44739,null,"NO","NO",null,null,null,1,"CJT",110,"ACTIVE",44739,null,"EDUCATION BUILDING","CRIMINAL JUSTICE TRAINING CENTER","2270 OLYMPIC",null,"EDUCATION BUILDING",311,350,2,20,227,null,33,6]
[20,6,"KING","A09525","CONFERENCE BUILDING",null,"Owned","ACTIVE","BUILDING","OFFICE","19010 1ST AVE S",null,"BURIEN","KING","WA",98148,"US","Jan 1, 1992, 12:00 AM",null,null,null,47.432918999999998,-122.333449,71815,null,"NO","NO",null,null,null,1,"CJT",311,"ACTIVE",71815,null,"CONFERENCE BUILDING","CRIMINAL JUSTICE TRAINING CENTER","2270 CASCADE",null,"CONFERENCE BUILDING",110,350,2,20,227,null,33,6]
[20,6,"KING","A04933","EVERGREEN",null,"Owned","ACTIVE","BUILDING","RESIDENTIAL","18792 JUSTICE WAY S",null,"BURIEN","KING","WA",98148,"US",null,null,"Jan 1, 2000, 12:00 AM",780000,47.433993999999998,-122.331502,7168,null,"NO","NO",null,null,null,1,"CJT",900,"ACTIVE",7168,null,"EVERGREEN","CRIMINAL JUSTICE TRAINING CENTER","2270 DORM 3",null,"EVERGREEN",null,null,2,20,227,null,33,6]
[20,6,"KING","A04830","MOCK CITY",null,"Owned","ACTIVE","BUILDING","EDUCATIONAL","19065 1ST PL S",null,"BURIEN","KING","WA",98148,"US",null,null,"Jan 1, 2000, 12:00 AM",null,47.432239000000003,-122.335033,6000,null,"NO","NO",null,null,null,1,"CJT",120,"ACTIVE",6000,null,"MOCK CITY","CRIMINAL JUSTICE TRAINING CENTER","2270 MOCK CITY",null,"MOCK CITY",null,null,3,20,227,null,33,6]
[20,6,"KING","A06266","FIRING RANGE",null,"Owned","ACTIVE","BUILDING","SPECIAL USE","18878 JUSTICE WAY S",null,"BURIEN","KING","WA",98148,"US",null,null,"Jan 1, 2000, 12:00 AM",2937276.87,47.433478999999998,-122.33184,12932,null,"NO","NO",null,null,null,1,"CJT",590,"ACTIVE",12932,null,"FIRING RANGE","CRIMINAL JUSTICE TRAINING CENTER","2270 RANGE",null,"FIRING RANGE",110,null,4,20,227,null,33,6]
[20,6,"KING","A03599","CEDAR HALL",null,"Owned","ACTIVE","BUILDING","EDUCATIONAL","18849 JUSTICE WAY S",null,"BURIEN","KING","WA",98148,"US",null,null,"Jan 1, 2008, 12:00 AM",220000,47.433931999999999,-122.332409,2880,null,"NO","NO",null,null,null,1,"CJT",110,"ACTIVE",2880,null,"CEDAR HALL","CRIMINAL JUSTICE TRAINING CENTER","2270 MODULAR CLASSROOM",null,"CEDAR HALL",null,null,2,20,227,null,33,6]
[20,6,"KING","A03124","DORM ONE",null,"Owned","ACTIVE","BUILDING","RESIDENTIAL","373 S 187TH LN",null,"BURIEN","KING","WA",98148,"US","Jan 1, 1992, 12:00 AM",null,null,null,47.434227,-122.33057100000001,20168,null,"NO","NO",null,null,null,1,"CJT",900,"ACTIVE",20168,null,"DORM ONE","CRIMINAL JUSTICE TRAINING CENTER","2270 DORM 1",null,"DORM ONE",null,null,5,20,227,null,33,6]
[20,6,"KING","A04434","FACILITIES",null,"Owned","ACTIVE","BUILDING","SUPPORT","190781 1ST PL S",null,"BURIEN","KING","WA",98148,"US",null,null,"Jan 1, 2000, 12:00 AM",93375.73,47.432487000000002,-122.33401499999999,3200,null,"NO","NO",null,null,null,1,"CJT",720,"ACTIVE",3200,null,"FACILITIES","CRIMINAL JUSTICE TRAINING CENTER","2270 WAREHOUSE",null,"FACILITIES",310,311,2,20,227,null,33,6]
[20,6,"KING","A04242","MADRONA",null,"Owned","ACTIVE","BUILDING","RESIDENTIAL","295 S 187TH LN",null,"BURIEN","KING","WA",98148,"US",null,null,"Jan 1, 1993, 12:00 AM",null,47.434336000000002,-122.33134699999999,11260,null,"NO","NO",null,null,null,1,"CJT",900,"ACTIVE",11260,null,"MADRONA","CRIMINAL JUSTICE TRAINING CENTER","2270 DORM 2",null,"MADRONA",null,null,2,20,227,null,33,6]
[]
[null,null,null,null,"School for the Deaf"]
[50,4,"CLARK","A09753","COTTAGE B (DEER EAST & WEST)",null,"Owned","ACTIVE","BUILDING","RESIDENTIAL","611 GRAND BLVD",null,"VANCOUVER","CLARK","WA",98661,"US",null,null,"Jan 1, 1999, 12:00 AM",1535500,45.623784999999998,-122.638988,9000,null,"NO","NO",null,null,null,1,"CDHL",900,"ACTIVE",9000,null,"COTTAGE B (DEER EAST & WEST)","STATE SCHOOL FOR THE DEAF","OFMSID00001","OFMFID00017","COTTAGE B (DEER EAST & WEST)",null,null,2,50,353,null,49,4]
[50,4,"CLARK","A07627","FIELD HOUSE",null,"Owned","ACTIVE","BUILDING","EDUCATIONAL","611 GRAND BLVD",null,"VANCOUVER","CLARK","WA",98661,"US",null,null,"Jan 1, 1969, 12:00 AM",120349,45.622320000000002,-122.640045,11850,null,"NO","NO",null,48139,null,1,"CDHL",110,"ACTIVE",11850,null,"FIELD HOUSE","STATE SCHOOL FOR THE DEAF","OFMSID00001","OFMFID00013","FIELD HOUSE",null,null,3,50,353,null,49,4]
[50,4,"CLARK","A09133","COTTAGE C (WATSON EAST & WEST)",null,"Owned","ACTIVE","BUILDING","RESIDENTIAL","611 GRAND BLVD",null,"VANCOUVER","CLARK","WA",98661,"US",null,null,"Jan 1, 1999, 12:00 AM",1535500,45.623910000000002,-122.639634,9000,null,"NO","NO",null,null,null,1,"CDHL",900,"ACTIVE",9000,null,"COTTAGE C (WATSON EAST & WEST)","STATE SCHOOL FOR THE DEAF","OFMSID00001","OFMFID00018","COTTAGE C (WATSON EAST & WEST)",null,null,2,50,353,null,49,4]
{"$rows_left_out":432}
{"sheet":"DSHS","index":5,"n_rows":569,"n_cols":13,"rows_kept":569,"cut":false,"hidden":true,"merged":[[1,1,1,6]]}
[]
[null,"DSHS Facilities"]
[null,"Facility","Address1","Address2","Leg","Team","County","Column1","Column2","Column3"]
["x","Canyon View Community Facility","260 North Georgia Ave East ","Wenatchee, WA 98802-4933",12,"D","Douglas","CVCF","CVCFBldg","CVCFBldgList"]
["x","Child Study and Treatment Center","8805 Steilacoom Blvd SW","Lakewood, WA 98498-4770",28,"D","Pierce","CSTC","CSTCBldg","CSTCBldgList"]
["x","Eastern State Hospital","850 Maple St","Medical Lake, WA 99022",9,"D","Spokane","ESH","ESHBldg","ESHBldgList"]
["x","Echo Glen Children's Center","33010 SE 99th St","Snoqualmie WA 98065",5,"D","King","EGCC","EGCCBldg","EGCCBldgList"]
["x","Fircrest School","15230 15th Ave NE","Shoreline WA. 98155-7130",32,"D","King","FS","FSBldg","FSBldgList"]
["x","Green Hill School","375 SW 11th St ","Chehalis WA 98532-4700",20,"D","Lewis","GHS","GHSBldg","GHSBldgList"]
["x","Lakeland Village ","23505 Salnave RD","Medical Lake, WA. 99022",9,"D","Spokane","LV","LVBldg","LVBldgList"]
["x","Naselle Youth Camp","11 Youth Camp LN","Naselle, WA 98638-8600",19,"D","Pacific","NYC","NYCBldg","NYCBldgList"]
[null,"Oakridge Community Facility","8701 Steilacoom Blvd","Lakewood, WA 98498-4711",28,"D","Pierce"]
["x","Olympic Center","3423 6th St","Bremerton, WA 98312",26,"D","Kitsap","OC","OCBldg","OCBldgList"]
["x","Parke Creek Community Facility","11042 Parke Creek RD","Ellensburg, WA 98926-7015",13,"D","Kittitas","PCCF","PCCFBldg","PCCFBldgList"]
[null,"Pine Lodge","751 Pine St","Medical Lake, WA 99022",9,"D","Spokane"]
{"$rows_left_out":555}
{"sheet":"DES","index":6,"n_rows":132,"n_cols":10,"rows_kept":132,"cut":false,"hidden":true,"merged":[]}
[]
[null,null,null,"DES Facilities"]
[null,"Facility","Adress1","City1","Facility2","Column1","Column2","Column3"]
[null,"East Capital Campus",null,null,null,"ECC","ECCBldg","ECCBldgList"]
[null,"North Cascades Gateway Center",null,null,null,"NCGC","NCGCBldg","NCGCBldgList"]
[null,"Off Campus - Olympia",null,null,null,"OCO","OCOBldg","OCOBldgList"]
[null,"Off Campus - Tumwater",null,null,null,"OCT","OCTBldg","OCTBldgList"]
[null,"Outside Thurston County",null,null,null,"OTC","OTCBldg","OTCBldgList"]
[null,"Parking Facilities - On Campus",null,null,null,"PFOC","PFOCBldg","PFOCBldgList"]
[null,"Parks & Grounds",null,null,null,"PG","PGBldg","PGBldgList"]
[null,"West Capital Campus",null,null,null,"WCaC","WCaCBldg","WCaCBldg"]
[]
[]
[null,"East Capital Campus"]
[null,"Agency Common Name","UFI","ADDRESS1","CITY","Zip Code","STATE","COUNTY","Legislative District","Facility"]
{"$rows_left_out":118}
{"sheet":"DOC","index":7,"n_rows":889,"n_cols":13,"rows_kept":889,"cut":false,"hidden":true,"merged":[]}
[]
[null,null,"DOC Facilities"]
[null,"Facility","Adress1","City1","Facility2","Column1","Column2"]
[null,"Ahtanum View Corrections Complex","2009 S 64th Ave","Yakima, Wa 98903-1025","AVCC","AVWRBldg","AVCCBldgList"]
["X","Airway Heights Corrections Center","11919 W Sprague Ave","Airway Heights, Wa 98001-1899","AHCC","AHCCBldg","AHCCBldgList"]
["X","Cedar Creek Corrections Center","12200 Bordeaux Rd","Littlerock, Wa 98556-0037","CCCC","CCCCBldg","CCCCBldgList"]
["X","Clallam Bay Corrections Center","1830 Eagle Crest Way","Clallam Bay, Wa 98326-9724","CBCC","CBCCBldg","CBCCBldgList"]
["x","Correctional Industries","801 88TH AVE SE","TUMWATER, WA 98501","CI","CIBldg","CIBldgList"]
["X","Coyote Ridge Corrections Center","1301 N Ephrata","Connell, Wa 99326-0769","CRCC","CRCCBldg","CRCCBldgList"]
[null,"Indian Ridge Corrections Center","19601 Nicks Rd","Arlington, Wa 98223-9515","IRCC","IRCCBldg","IRCCBldgList"]
["x","Larch Corrections Center","15314 NE Dole Valley Rd","Yacolt, Wa 98675-9521","LCC","LCC_Bldg","LCC_BldgList"]
["x","McNeil Island Corrections Center","35 Settler Street","Steilacoom, Wa 98388-0499","MICC","MICCBldg","MICCBldgList"]
["x","Mission Creek Corrections Center For Women","3420 NE Sand Hill Rd","Belfair, Wa 98528-9007","MCCCW","MCCCWBldg","MCCCWBldgList"]
["x","Monroe Corrections Complex","16700 177th Avenue SE","Monroe, Wa 98272-0777","MCC","MCCBldg","MCCBldgList"]
["x","Olympic Corrections Center","11235 Hoh Mainline Rd","Forks, Wa 98331-9492","OCC","OCCBldg","OCCBldgList"]
{"$rows_left_out":875}
{"sheet":"IAA Fee %","index":8,"n_rows":49,"n_cols":12,"rows_kept":49,"cut":false,"hidden":true,"merged":[[3,5,3,6],[3,1,3,2],[3,3,3,4]]}
[]
[null,"PM fee=(Project Cost)-0.65x100+0.16=fee%"]
[]
["Project Value","A - Complex Project",null,"B - Average Complexity",null,"C - Simple"]
[null,"Fee","Fee %","Fee","Fee %","Fee","Fee %"]
[25000,{"$f":"A6*C6","v":4488},0.17952000000000001,{"$f":"A6*E6","v":3740.0000000000005},0.14960000000000001,{"$f":"A6*G6","v":2992},0.11967999999999999,null,{"$f":"A17^(-0.65)*(100+0.16)","v":1.2609396924530378E-2}]
[50000,5610,0.11219999999999999,4675,9.35E-2,3740.0000000000005,7.4800000000000005E-2]
[100000,7013,7.0129999999999998E-2,5844,5.8439999999999999E-2,4675,4.675E-2,null,1000000]
[200000,11682,5.8409999999999997E-2,9735,4.8675000000000003E-2,7788.0000000000009,3.8940000000000002E-2]
[300000,14447,4.8156666666666667E-2,12039,4.0129999999999999E-2,9631,3.2103333333333331E-2,null,{"$f":"I8*I6","v":12609.396924530378}]
[400000,16910,4.2275E-2,14091,3.5227500000000002E-2,11273,2.8182499999999999E-2]
[500000,18965,3.7929999999999998E-2,15803.999999999998,3.1607999999999997E-2,12644,2.5288000000000001E-2,null,null,null,null," "]
[600000,20641,3.4401666666666664E-2,17201,2.8668333333333334E-2,13760,2.2933333333333333E-2]
[700000,23116.000000000004,3.3022857142857145E-2,19264,2.7519999999999999E-2,15410.999999999998,2.2015714285714284E-2]
[800000,25324.999999999996,3.1656249999999997E-2,21104,2.6380000000000001E-2,16883,2.1103750000000001E-2]
{"$rows_left_out":34}